BDBM24342 4-{[(4-bromo-3-hydroxyphenyl)methyl](4H-1,2,4-triazol-4-yl)amino}benzonitrile::m-phenol, 16h
SMILES Oc1cc(CN(c2ccc(cc2)C#N)n2cnnc2)ccc1Br
InChI Key InChIKey=WKQPRXJLBFKRFZ-UHFFFAOYSA-N
Data  1 IC50
  Tab Delimited (TSV)   2D SDfile   Computed 3D by Vconf -m prep SDfile
Find this compound or compounds like it in BindingDB:
Activity Spreadsheet -- Enzyme Inhibition Constant Data from BindingDB
Found 1 hit for monomerid = 24342
TargetAromatase(Homo sapiens (Human))
University Of Bath
LigandPNGBDBM24342(4-{[(4-bromo-3-hydroxyphenyl)methyl](4H-1,2,4-tria...)
Affinity DataIC50:  0.5nMpH: 7.5 T: 2°C. Assay description: The extent of in vitro inhibition of aromatase activities was assessed using intact monolayers of JEG-3 cells. Aromatase activity was measured using ...
In DepthDetails ArticlePubMed