BDBM243692 US9428456, 1.313
SMILES Cc1c(CN2CCC(CC2)C(=O)NC(C)(C)C)cccc1NC(=O)c1ccc(F)cc1
InChI Key InChIKey=KSEWEFFECBPGEF-UHFFFAOYSA-N
Data  1 EC50
  Tab Delimited (TSV)   2D SDfile   Computed 3D by Vconf -m prep SDfile
Find this compound or compounds like it in BindingDB:
Activity Spreadsheet -- Enzyme Inhibition Constant Data from BindingDB
Found 1 hit for monomerid = 243692
TargetAtypical chemokine receptor 3(Homo sapiens (Human))
Actelion Pharmaceuticals
US Patent
LigandPNGBDBM243692(US9428456, 1.313)
Affinity DataEC50:  19nMT: 2°C. Assay description: CHO-K1 CXCR7 b-arrestin cells are detached from culture dishes with a cell dissociation buffer (Invitrogen, #13151-014) and collected in growing medi...
Ligand InfoPC cidPC sid
In DepthDetails US Patent