BDBM243720 US9428456, 3.004
SMILES Clc1ccc(cc1)C(=O)Nc1cncc(CN2CCC(CC2)C(=O)NC2CCCCC2)c1
InChI Key InChIKey=AZFLPXGKNFDPPZ-UHFFFAOYSA-N
Data  1 EC50
  Tab Delimited (TSV)   2D SDfile   Computed 3D by Vconf -m prep SDfile
Find this compound or compounds like it in BindingDB:
Activity Spreadsheet -- Enzyme Inhibition Constant Data from BindingDB
Found 1 hit for monomerid = 243720
TargetAtypical chemokine receptor 3(Homo sapiens (Human))
Actelion Pharmaceuticals
US Patent
LigandPNGBDBM243720(US9428456, 3.004)
Affinity DataEC50:  36nMT: 2°C. Assay description: CHO-K1 CXCR7 b-arrestin cells are detached from culture dishes with a cell dissociation buffer (Invitrogen, #13151-014) and collected in growing medi...
Ligand InfoPC cidPC sid
In DepthDetails US Patent