BDBM2438 US8507533, 158
SMILES CCOC(=O)CCNC(=O)c1ccc(cc1)C(Nc1cnc(nc1)-n1cc(cn1)C(F)(F)F)C1CC(C)(C)C1
InChI Key InChIKey=JMTMNMHWZNMAJJ-UHFFFAOYSA-N
Data  1 KI
  Tab Delimited (TSV)   2D SDfile   Computed 3D by Vconf -m prep SDfile
Find this compound or compounds like it in BindingDB:
Activity Spreadsheet -- Enzyme Inhibition Constant Data from BindingDB
Found 1 hit for monomerid = 2438
TargetPro-glucagon(Homo sapiens (Human))
Pfizer
US Patent
LigandPNGBDBM2438(US8507533, 158)
Affinity DataKi:  41nM. Assay description: The Glucagon SPA assay is used to determine the ability of test compounds to block the binding of glucagon-cex to the glucagon receptors.
In DepthDetails US Patent