BDBM244220 US9428501, 7
SMILES COc1cnc(CN2CCC(CC2)c2ccc3[nH]c(nc3c2)C(=O)N2CCN(Cc3ccc(cc3)C(F)(F)F)CC2)cn1
InChI Key InChIKey=WTVQQXGHNYQSSQ-UHFFFAOYSA-N
Data  2 IC50  1 EC50
  Tab Delimited (TSV)   2D SDfile   Computed 3D by Vconf -m prep SDfile
Find this compound or compounds like it in BindingDB:
Activity Spreadsheet -- Enzyme Inhibition Constant Data from BindingDB
Found 3 hits for monomerid = 244220
TargetPhosphatidylinositol 4,5-bisphosphate 3-kinase catalytic subunit alpha isoform(Homo sapiens (Human))
Astellas Pharma
US Patent
LigandPNGBDBM244220(US9428501, 7)
Affinity DataIC50:  75nMpH: 7.5Assay Description:Human PIK3CA mutation-positive breast cancer cell line MDA-MB-453 cells were subcutaneously implanted into nude mice, MDA-MB-453 tumor was excised, a...
Ligand InfoPC cidPC sid
In DepthDetails US Patent
TargetPhosphatidylinositol 4,5-bisphosphate 3-kinase catalytic subunit alpha isoform(Homo sapiens (Human))
Astellas Pharma
US Patent
LigandPNGBDBM244220(US9428501, 7)
Affinity DataIC50:  12nM. Assay description: In order to make human PIK3 CA mutation-positive breast cancer cell line MDA-MB-453 cells become 500 cells per well in a 384 well non-adhesive plate ...
Ligand InfoPC cidPC sid
In DepthDetails US Patent
Target5'-AMP-activated protein kinase catalytic subunit alpha-2(Homo sapiens (Human))
Astellas Pharma
US Patent
LigandPNGBDBM244220(US9428501, 7)
Affinity DataEC50:  8.30nMT: 2°C. Assay description: In order to make MDA-MB-453 cell become 15000 cells per well, each 36 μl was seeded in Leibovitz's L-15 medium including 10% fetal bovine serum (m...
Ligand InfoPC cidPC sid
In DepthDetails US Patent