BDBM244692 US9550763, Compound I-157
SMILES Cc1cc(Nc2nc(=O)c(cn2Cc2ccc(Cl)cc2)C(=O)NC2CCOCC2)ccc1Oc1cccc(F)n1
InChI Key InChIKey=GOJOTWOFIPQUEN-UHFFFAOYSA-N
Data  1 IC50
  Tab Delimited (TSV)   2D SDfile   Computed 3D by Vconf -m prep SDfile
Find this compound or compounds like it in BindingDB:
Activity Spreadsheet -- Enzyme Inhibition Constant Data from BindingDB
Found 1 hit for monomerid = 244692
TargetP2X purinoceptor 3(Homo sapiens (Human))
Shionogi
US Patent
LigandPNGBDBM244692(US9550763, Compound I-157)
Affinity DataIC50:  11nMpH: 7.5Assay Description:Stably expressing cell line (C6BU-1 cell transfected with human P2X3 receptor gene (GenBank accession number Y07683) was used. The cells were seeded ...
Ligand InfoPC cidPC sid
In DepthDetails US Patent