BDBM24491 7-(2-fluoro-4-{[(1-phenylacetamido)methanethioyl]amino}phenoxy)thieno[3,2-b]pyridine-2-carboxamide::thieno[3,2-b]pyridine-based inhibitor, 8a
SMILES NC(=O)c1cc2nccc(Oc3ccc(NC(=S)NC(=O)Cc4ccccc4)cc3F)c2s1
InChI Key InChIKey=YGNICMCKWLGMLK-UHFFFAOYSA-N
Data  3 IC50
  Tab Delimited (TSV)   2D SDfile   Computed 3D by Vconf -m prep SDfile
Find this compound or compounds like it in BindingDB:
Activity Spreadsheet -- Enzyme Inhibition Constant Data from BindingDB
Found 3 hits for monomerid = 24491
TargetHepatocyte growth factor receptor(Homo sapiens (Human))
Methylgene
LigandPNGBDBM24491(7-(2-fluoro-4-{[(1-phenylacetamido)methanethioyl]a...)
Affinity DataIC50:  65nMpH: 7.5 T: 2°C. Assay description: Inhibition of kinase activity was measured in a DELFIA assay (Perkin-Elmer). The substrate poly (Glu4, Tyr) was immobilized onto black high-binding p...
In DepthDetails ArticlePubMed
TargetHepatocyte growth factor receptor(Homo sapiens (Human))
Methylgene
LigandPNGBDBM24491(7-(2-fluoro-4-{[(1-phenylacetamido)methanethioyl]a...)
Affinity DataIC50:  65nM. Assay description: Inhibition of human c-MET
In DepthDetails ArticlePubMed
TargetVascular endothelial growth factor receptor 2(Homo sapiens (Human))
Methylgene
LigandPNGBDBM24491(7-(2-fluoro-4-{[(1-phenylacetamido)methanethioyl]a...)
Affinity DataIC50:  129nM. Assay description: Inhibition of kinase activity was measured in a DELFIA assay (Perkin-Elmer). The substrate poly (Glu4, Tyr) was immobilized onto black high-binding p...
In DepthDetails ArticlePubMed