BDBM245190 US9550763, Compound I-226
SMILES Clc1ccc(Cn2c(=O)c(NC(=O)c3ccon3)c[nH]\c2=N/c2ccc(Oc3ccon3)cc2)cc1
InChI Key InChIKey=OTOWLLIXRHLTRU-UHFFFAOYSA-N
Data  1 IC50
  Tab Delimited (TSV)   2D SDfile   Computed 3D by Vconf -m prep SDfile
Find this compound or compounds like it in BindingDB:
Activity Spreadsheet -- Enzyme Inhibition Constant Data from BindingDB
Found 1 hit for monomerid = 245190
TargetP2X purinoceptor 3(Homo sapiens (Human))
Shionogi
US Patent
LigandPNGBDBM245190(US9550763, Compound I-226)
Affinity DataIC50:  208nMpH: 7.5Assay Description:Stably expressing cell line (C6BU-1 cell transfected with human P2X3 receptor gene (GenBank accession number Y07683) was used. The cells were seeded ...
Ligand InfoPC cidPC sid
In DepthDetails US Patent