BDBM245378 US9428504, 128
SMILES COc1ccc2nc(sc2c1)-c1ccc(O)c2N(CC3(CCN(CC(C)(C)C)CC3)c12)c1ccccc1NC(=O)Nc1csc(Cl)n1
InChI Key InChIKey=CMZQICOJEXTCIU-UHFFFAOYSA-N
Data  1 KI
  Tab Delimited (TSV)   2D SDfile   Computed 3D by Vconf -m prep SDfile
Find this compound or compounds like it in BindingDB:
Activity Spreadsheet -- Enzyme Inhibition Constant Data from BindingDB
Found 1 hit for monomerid = 245378
TargetP2Y purinoceptor 1(Homo sapiens (Human))
Bristol-Myers Squibb
US Patent
LigandPNGBDBM245378(US9428504, 128)
Affinity DataKi:  8nM ΔG°:  -11.0kcal/molepH: 7.4 T: 2°C. Assay description: A SPA membrane binding assay was used to identify inhibitors of [33P] 2MeS-ADP binding to cloned human P2Y1 receptors (The P2Y1 receptor membranes we...
Ligand InfoPC cidPC sid
In DepthDetails US Patent