BDBM245394 US9428504, 144
SMILES CC(C)(C)CN1CCC2(CN(c3c2c(ccc3O)-c2nc3ccc(F)cc3s2)c2ccccc2NC(=O)Nc2nc3ccc(Cl)nc3s2)CC1
InChI Key InChIKey=BFTHWWMBOIETHI-UHFFFAOYSA-N
Data  1 KI
  Tab Delimited (TSV)   2D SDfile   Computed 3D by Vconf -m prep SDfile
Find this compound or compounds like it in BindingDB:
Activity Spreadsheet -- Enzyme Inhibition Constant Data from BindingDB
Found 1 hit for monomerid = 245394
TargetP2Y purinoceptor 1(Homo sapiens (Human))
Bristol-Myers Squibb
US Patent
LigandPNGBDBM245394(US9428504, 144)
Affinity DataKi:  13nM ΔG°:  -10.8kcal/molepH: 7.4 T: 2°C. Assay description: A SPA membrane binding assay was used to identify inhibitors of [33P] 2MeS-ADP binding to cloned human P2Y1 receptors (The P2Y1 receptor membranes we...
Ligand InfoPC cidPC sid
In DepthDetails US Patent