BDBM245410 US9428504, 168
SMILES CC(C)(C)CN1CCC2(CN(c3c2c(F)ccc3O)c2ccccc2NC(=O)Nc2nc3ccc(Cl)nc3s2)CC1
InChI Key InChIKey=QXNFYMPSSFCXKB-UHFFFAOYSA-N
Data  1 KI
  Tab Delimited (TSV)   2D SDfile   Computed 3D by Vconf -m prep SDfile
Find this compound or compounds like it in BindingDB:
Activity Spreadsheet -- Enzyme Inhibition Constant Data from BindingDB
Found 1 hit for monomerid = 245410
TargetP2Y purinoceptor 1(Homo sapiens (Human))
Bristol-Myers Squibb
US Patent
LigandPNGBDBM245410(US9428504, 168)
Affinity DataKi:  8.60nM ΔG°:  -11.0kcal/molepH: 7.4 T: 2°C. Assay description: A SPA membrane binding assay was used to identify inhibitors of [33P] 2MeS-ADP binding to cloned human P2Y1 receptors (The P2Y1 receptor membranes we...
Ligand InfoPC cidPC sid
In DepthDetails US Patent