BDBM245501 US9428503, 29
SMILES Cn1c2cnc3ccc(cc3c2n([C@H]2CCCOC2)c1=O)-c1ccc(OCCCN2CCCC2)nc1
InChI Key InChIKey=YXJGKECEJNCEIH-QFIPXVFZSA-N
Data  4 IC50
  Tab Delimited (TSV)   2D SDfile   Computed 3D by Vconf -m prep SDfile
Find this compound or compounds like it in BindingDB:
Activity Spreadsheet -- Enzyme Inhibition Constant Data from BindingDB
Found 4 hits for monomerid = 245501
TargetSerine-protein kinase ATM(Homo sapiens (Human))
Astrazeneca
US Patent
LigandPNGBDBM245501(US9428503, 29)
Affinity DataIC50:  0.238nMT: 2°C. Assay description: Assay a) HT29 cells (ECACC #85061109) were seeded into 384 well assay plates (Costar #3712) at a density of 3500 cells/well in 40 μl EMEM medium c...
Ligand InfoPC cidPC sid
In DepthDetails US Patent
TargetSerine/threonine-protein kinase mTOR(Homo sapiens (Human))
Astrazeneca
US Patent
LigandPNGBDBM245501(US9428503, 29)
Affinity DataIC50:  605nMT: 2°C. Assay description: Assay d) MDA-MB-468 cells (human breast adenocarcinoma ##ATCC HTB 132) were seeded at 1500 cells/well in 40 μl of DMEM containing 10% FBS and 1% g...
Ligand InfoPC cidPC sid
In DepthDetails US Patent
LigandPNGBDBM245501(US9428503, 29)
Affinity DataIC50:  1.65E+3nMT: 2°C. Assay description: Assay c) BT474 cells (human breast ductal carcinoma, ATCC HTB-20) were seeded into black 384 well plates (Costar, #3712) at a density of 5600 cells/w...
Ligand InfoPC cidPC sid
In DepthDetails US Patent
TargetSerine/threonine-protein kinase ATR(Homo sapiens (Human))
Astrazeneca
US Patent
LigandPNGBDBM245501(US9428503, 29)
Affinity DataIC50:  1.90E+4nMT: 2°C. Assay description: Assay b) HT29 cells (ECACC #85061109) were seeded into 384 well assay plates (Costar #3712) at a density of 6000 cells/well in 40 μl EMEM medium c...
Ligand InfoPC cidPC sid
In DepthDetails US Patent