BDBM24556 Pirinixic acid-based compound, 2h::ethyl 2-{[4-chloro-6-(2,3-dihydro-1H-inden-4-ylamino)pyrimidin-2-yl]sulfanyl}acetate
SMILES CCOC(=O)CSc1nc(Cl)cc(Nc2cccc3CCCc23)n1
InChI Key InChIKey=DXJHSTIMQDSGRK-UHFFFAOYSA-N
Data  1 EC50
  Tab Delimited (TSV)   2D SDfile   Computed 3D by Vconf -m prep SDfile
Find this compound or compounds like it in BindingDB:
Activity Spreadsheet -- Enzyme Inhibition Constant Data from BindingDB
Found 1 hit for monomerid = 24556
TargetPolyunsaturated fatty acid 5-lipoxygenase(Homo sapiens (Human))
Eberhard Karls University Tuebingen
LigandPNGBDBM24556(Pirinixic acid-based compound, 2h | ethyl 2-{[4-ch...)
Affinity DataEC50:  3.20E+3nMpH: 7.4 T: 2°C. Assay description: For assays of intact cells, 5000,000 freshly isolated PMNL cells were resuspended in PGC buffer. After preincubation with the test compounds for 15 m...
In DepthDetails ArticlePubMed