BDBM2457 US8507510, 1.18
SMILES C[C@@H](O)[C@@H](C)Nc1nc(Nc2ccc(cc2)S(=N)(=O)CCO)ncc1Br
InChI Key InChIKey=KJSJBGZSEZVHMS-ZNTSSAEJSA-N
Data  2 IC50
  Tab Delimited (TSV)   2D SDfile   Computed 3D by Vconf -m prep SDfile
Find this compound or compounds like it in BindingDB:
Activity Spreadsheet -- Enzyme Inhibition Constant Data from BindingDB
Found 2 hits for monomerid = 2457
TargetCyclin-dependent kinase 1(Homo sapiens (Human))
Bayer Intellectual Property
US Patent
LigandPNGBDBM2457(US8507510, 1.18)
Affinity DataIC50:  3nM. Assay description: Kinase assay using either CDK1, CDK2 or VEGFR-2.
In DepthDetails US Patent
TargetCyclin-dependent kinase 2(Homo sapiens (Human))
Bayer Intellectual Property
US Patent
LigandPNGBDBM2457(US8507510, 1.18)
Affinity DataIC50:  3nM. Assay description: Kinase assay using either CDK1, CDK2 or VEGFR-2.
In DepthDetails US Patent