BDBM246296 US10183932, Example 202::US9434690, 202::US9822102, Example 202
SMILES OC(=O)c1ccc(NC(=O)C(C[C@@H]2CCCCO2)n2cc(Cl)c(cc2=O)-c2cc(Cl)ccc2C#N)cc1
InChI Key InChIKey=KBFYCDAOFYYRQQ-QHELBMECSA-N
Data  6 IC50
  Tab Delimited (TSV)   2D SDfile   Computed 3D by Vconf -m prep SDfile
Find this compound or compounds like it in BindingDB:
Activity Spreadsheet -- Enzyme Inhibition Constant Data from BindingDB
Found 6 hits for monomerid = 246296
TargetCoagulation factor XI(Homo sapiens (Human))
Bayer Pharma Aktiengesellschaft
US Patent
LigandPNGBDBM246296(US10183932, Example 202 | US9434690, 202 | US98221...)
Affinity DataIC50:  2.90nMpH: 7.4 T: 2°C. Assay description: Test substances are dissolved in dimethyl sulphoxide and serially diluted in dimethyl sulphoxide (3000 μM to 0.0078 μM; resulting final con...
Ligand InfoPC cidPC sid
In DepthDetails US Patent
TargetPlasma kallikrein(Homo sapiens (Human))
Bayer Pharma Aktiengesellschaft
US Patent
LigandPNGBDBM246296(US10183932, Example 202 | US9434690, 202 | US98221...)
Affinity DataIC50:  82nMpH: 7.4 T: 2°C. Assay description: Test substances are dissolved in dimethyl sulphoxide and serially diluted in dimethyl sulphoxide (3000 μM to 0.0078 μM; resulting final con...
Ligand InfoPC cidPC sid
In DepthDetails US Patent
TargetPlasma kallikrein(Homo sapiens (Human))
Bayer Pharma Aktiengesellschaft
US Patent
LigandPNGBDBM246296(US10183932, Example 202 | US9434690, 202 | US98221...)
Affinity DataIC50:  82nM. Assay description: Test substances are dissolved in dimethyl sulphoxide and serially diluted in dimethyl sulphoxide (3000 μM to 0.0078 μM; resulting final con...
Ligand InfoPC cidPC sid
In DepthDetails US Patent
TargetCoagulation factor XI(Homo sapiens (Human))
Bayer Pharma Aktiengesellschaft
US Patent
LigandPNGBDBM246296(US10183932, Example 202 | US9434690, 202 | US98221...)
Affinity DataIC50:  82nM. Assay description: To determine the factor XIa inhibition of the substances according to the invention, a biochemical test system is used which utilizes the reaction of...
Ligand InfoPC cidPC sid
In DepthDetails US Patent
TargetCoagulation factor XI(Homo sapiens (Human))
Bayer Pharma Aktiengesellschaft
US Patent
LigandPNGBDBM246296(US10183932, Example 202 | US9434690, 202 | US98221...)
Affinity DataIC50:  2.90nM. Assay description: Test substances are dissolved in dimethyl sulphoxide and serially diluted in dimethyl sulphoxide (3000 μM to 0.0078 μM; resulting final con...
Ligand InfoPC cidPC sid
In DepthDetails US Patent
TargetCoagulation factor XI(Homo sapiens (Human))
Bayer Pharma Aktiengesellschaft
US Patent
LigandPNGBDBM246296(US10183932, Example 202 | US9434690, 202 | US98221...)
Affinity DataIC50:  2.90nM. Assay description: To determine the factor XIa inhibition of the substances according to the invention, a biochemical test system is used which utilizes the reaction of...
Ligand InfoPC cidPC sid
In DepthDetails US Patent