BDBM246419 US9447057, 5
SMILES C(=N/c1nc(cs1)-c1ccccc1)\c1ccncc1
InChI Key InChIKey=XANXKOZYSJGJJY-LICLKQGHSA-N
Data  1 KI  1 IC50
  Tab Delimited (TSV)   2D SDfile   Computed 3D by Vconf -m prep SDfile
Find this compound or compounds like it in BindingDB:
Activity Spreadsheet -- Enzyme Inhibition Constant Data from BindingDB
Found 1 hit for monomerid = 246419
TargetUrease(Canavalia ensiformis (Jack bean) (Horse bean))
TBA
US Patent
LigandPNGBDBM246419(US9447057, 5)
Affinity DataKi:  1.36E+4nM IC50:  7.60E+3nMpH: 6.8Assay Description:Reaction mixtures consisting of 25 μL (1 unit/well) of Jack bean (Canavalia ensiformis) urease, 55 μL of buffer at pH 6.8, 100 mM of urea, ...
Ligand InfoPC cidPC sid
In DepthDetails US Patent