BDBM246743 US9550763, Compound I-397
SMILES Fc1cccc(Oc2ccc(Nc3nc(=O)c(cn3Cc3ccc(Cl)cc3)C(=O)Nc3cnoc3)cc2)n1
InChI Key InChIKey=TYXZSDAMOJTBSY-UHFFFAOYSA-N
Data  1 IC50
  Tab Delimited (TSV)   2D SDfile   Computed 3D by Vconf -m prep SDfile
Find this compound or compounds like it in BindingDB:
Activity Spreadsheet -- Enzyme Inhibition Constant Data from BindingDB
Found 1 hit for monomerid = 246743
TargetP2X purinoceptor 3(Homo sapiens (Human))
Shionogi
US Patent
LigandPNGBDBM246743(US9550763, Compound I-397)
Affinity DataIC50:  56nMpH: 7.5Assay Description:Stably expressing cell line (C6BU-1 cell transfected with human P2X3 receptor gene (GenBank accession number Y07683) was used. The cells were seeded ...
Ligand InfoPC cidPC sid
In DepthDetails US Patent