BDBM247149 (S,E)-2-Methyl-N-(2,2,2-trifluoro-1-(2-fluoro-4-((6,6,6-trifluorohexyl)oxy)phenyl)ethylidene)propane-2-sulfinamide::US9701672, 3
SMILES FC(F)(F)CCCOc1ccc(cc1)[C@@]1(CC(c2ccc(Cl)s2)=C(c2nnn[nH]2)C(=O)N1)C(F)(F)F
InChI Key
Data  1 IC50
  Tab Delimited (TSV)   2D SDfile   Computed 3D by Vconf -m prep SDfile
Find this compound or compounds like it in BindingDB:
Activity Spreadsheet -- Enzyme Inhibition Constant Data from BindingDB
Found 1 hit for monomerid = 247149
TargetAlpha-1,6-mannosyl-glycoprotein 2-beta-N-acetylglucosaminyltransferase(Homo sapiens (Human))
Bristol-Myers Squibb
US Patent
LigandPNGBDBM247149((S,E)-2-Methyl-N-(2,2,2-trifluoro-1-(2-fluoro-4-((...)
Affinity DataIC50:  370nMpH: 7.4Assay Description:The MGAT enzyme reactions were performed in Corning FALCONŽ 96-well polypropylene plates, in a total volume of 60 μL of 50 mM potassium phosphat...
Ligand InfoPC cidPC sid
In DepthDetails US Patent