BDBM24721 5-ethyl-7,7,16-trimethyl-5,11,14,15-tetraazapentacyclo[10.8.0.0^{2,10}.0^{4,8}.0^{13,17}]icosa-1(12),2,4(8),9,13,16-hexaen-6-one::AKI-001::JMC514465 Compound 32
SMILES CCN1C(=O)C(C)(C)c2cc3[nH]c4-c5n[nH]c(C)c5CCCc4c3cc12
InChI Key InChIKey=AOMMPEGZDRAGRC-UHFFFAOYSA-N
Data  2 IC50
  Tab Delimited (TSV)   2D SDfile   Computed 3D by Vconf -m prep SDfile
Find this compound or compounds like it in BindingDB:
Activity Spreadsheet -- Enzyme Inhibition Constant Data from BindingDB
Found 2 hits for monomerid = 24721
TargetAurora kinase B(Homo sapiens (Human))
Genentech
LigandPNGBDBM24721(5-ethyl-7,7,16-trimethyl-5,11,14,15-tetraazapentac...)
Affinity DataIC50:  5nMpH: 7.5 T: 2°C. Assay description: Aurora kinase was assayed in ELISA format using a GST fusion of the N-terminus of Histone H3 as substrate. Plates were coated with substrate, and the...
In DepthDetails ArticlePubMed
TargetAurora kinase A(Homo sapiens (Human))
Genentech
LigandPNGBDBM24721(5-ethyl-7,7,16-trimethyl-5,11,14,15-tetraazapentac...)
Affinity DataIC50:  4nMpH: 7.5 T: 2°C. Assay description: Aurora kinase was assayed in ELISA format using a GST fusion of the N-terminus of Histone H3 as substrate. Plates were coated with substrate, and the...
In DepthDetails ArticlePubMedMMDB