BDBM247615 US10112931, Example 217::US9434719, 217 as TFA salt::US9688672, Example 217
SMILES C[C@@H](O)[C@H]1COC(=O)N1c1nc(N[C@@H](C)c2cnc(s2)-c2ccc(Cl)cc2)ncc1F
InChI Key InChIKey=WUFHWWGCPRCXLY-FIXISWKDSA-N
Data  5 IC50
  Tab Delimited (TSV)   2D SDfile   Computed 3D by Vconf -m prep SDfile
Find this compound or compounds like it in BindingDB:
Activity Spreadsheet -- Enzyme Inhibition Constant Data from BindingDB
Found 5 hits for monomerid = 247615
TargetIsocitrate dehydrogenase [NADP] cytoplasmic(Homo sapiens (Human))
Novartis
US Patent
LigandPNGBDBM247615(US10112931, Example 217 | US9434719, 217 as TFA sa...)
Affinity DataIC50:  22.5nMpH: 7.5 T: 2°C. Assay description: The IDH1 (R132H) mutant catalyzes the reduced form of NADP+ (NADPH) and α-ketoglutarate (α-KG) to form nicotinamide adenine dinucleotide ph...
Ligand InfoPC cidPC sid
In DepthDetails US Patent
TargetIsocitrate dehydrogenase [NADP] cytoplasmic(Homo sapiens (Human))
Novartis
US Patent
LigandPNGBDBM247615(US10112931, Example 217 | US9434719, 217 as TFA sa...)
Affinity DataIC50:  22nMpH: 7.4 T: 2°C. Assay description: The biochemical reactions were performed at room temperature in 384-well Greiner flat-bottom plates (Costar, Cat. No. 781201) using a final reaction ...
Ligand InfoPC cidPC sid
In DepthDetails US Patent
TargetIsocitrate dehydrogenase [NADP] cytoplasmic [R132H](Homo sapiens (Human))
Novartis
US Patent
LigandPNGBDBM247615(US10112931, Example 217 | US9434719, 217 as TFA sa...)
Affinity DataIC50:  19nMpH: 7.4 T: 2°C. Assay description: Mutant IDH1 R132H catalytic activity was monitored using the quantitative liquid chromatography/mass spectrometry (LC-MS) detection of 2-HG, a produc...
Ligand InfoPC cidPC sid
In DepthDetails US Patent
TargetIsocitrate dehydrogenase [NADP] cytoplasmic [R132H](Homo sapiens (Human))
Novartis
US Patent
LigandPNGBDBM247615(US10112931, Example 217 | US9434719, 217 as TFA sa...)
Affinity DataIC50:  12nMpH: 7.5 T: 2°C. Assay description: The IDH1 (R132H) mutant catalyzes the reduced form of NADP+ (NADPH) and α-ketoglutarate (α-KG) to form nicotinamide adenine dinucleotide ph...
Ligand InfoPC cidPC sid
In DepthDetails US Patent
TargetIsocitrate dehydrogenase [NADP] cytoplasmic [R132H](Homo sapiens (Human))
Novartis
US Patent
LigandPNGBDBM247615(US10112931, Example 217 | US9434719, 217 as TFA sa...)
Affinity DataIC50:  22nMpH: 7.5 T: 2°C. Assay description: The IDH1 (R132H) mutant catalyzes the reduced form of NADP+(NADPH) and α-ketoglutarate (α-KG) to form nicotinamide adenine dinucleotide pho...
Ligand InfoPC cidPC sid
In DepthDetails US Patent