BDBM248045 5-(1-((4'-Fluorobiphenyl-4-yl)methyl)piperidin-4-yl)-1H-benzo[d]imidazol-2(3H)-one (5b)
SMILES Fc1ccc(cc1)-c1ccc(CN2CCC(CC2)c2ccc3[nH]c(=O)[nH]c3c2)cc1
InChI Key InChIKey=VJWKFQAMDOJJDY-UHFFFAOYSA-N
Data  2 KI
  Tab Delimited (TSV)   2D SDfile   Computed 3D by Vconf -m prep SDfile
Find this compound or compounds like it in BindingDB:
Activity Spreadsheet -- Enzyme Inhibition Constant Data from BindingDB
Found 2 hits for monomerid = 248045
Target5-hydroxytryptamine receptor 1A(Homo sapiens (Human))
King Fahd University Of Petroleum & Minerals
LigandPNGBDBM248045(5-(1-((4'-Fluorobiphenyl-4-yl)methyl)piperidin...)
Affinity DataKi:  16.2nM ΔG°:  -11.0kcal/molepH: 7.4 T: 2°C. Assay description: Human-cloned 5-HT1A serotonin receptors stably expressed in HEK293-EBNA cells (Perkin-Elmer, Waltham, MA) were radiolabeled with 1.0nM [3H]-8-OH-DPAT...
Ligand InfoPC cidPC sid
In DepthDetails ArticlePubMed
TargetD(2) dopamine receptor(Homo sapiens (Human))
King Fahd University Of Petroleum & Minerals
LigandPNGBDBM248045(5-(1-((4'-Fluorobiphenyl-4-yl)methyl)piperidin...)
Affinity DataKi:  34.4nM ΔG°:  -10.2kcal/molepH: 7.4 T: 2°C. Assay description: Human-cloned dopamine D2L receptors stably expressed in C6 rat glioma cells (kindly donated by Professor Roberto Maggio, Università di L'Aquil...
Ligand InfoPC cidPC sid
In DepthDetails ArticlePubMed