BDBM248174 US9434711, 4
SMILES Fc1ccc(CN(c2sc3ccccc3c2Cl)S(=O)(=O)c2ccccc2)cc1
InChI Key InChIKey=CXEVAEUZRUMXDD-UHFFFAOYSA-N
Data  1 IC50
  Tab Delimited (TSV)   2D SDfile   Computed 3D by Vconf -m prep SDfile
Find this compound or compounds like it in BindingDB:
Activity Spreadsheet -- Enzyme Inhibition Constant Data from BindingDB
Found 1 hit for monomerid = 248174
TargetTransient receptor potential M8 protein(Canis lupus familiaris (Dog))
Janssen Pharmaceutica
US Patent
LigandPNGBDBM248174(US9434711, 4)
Affinity DataIC50:  4nMT: 2°C. Assay description: The functional activity of compounds of the formula (I) was determined by measuring changes in intracellular calcium concentration using a Ca2+-sensi...
Ligand InfoPC cidPC sid
In DepthDetails US Patent