BDBM248318 US9434711, 171
SMILES [O-][N+](=O)c1ccccc1CN(c1sc2ccccc2c1Br)S(=O)(=O)c1ccccc1
InChI Key InChIKey=CGPIQJQDYSQDBT-UHFFFAOYSA-N
Data  1 IC50
  Tab Delimited (TSV)   2D SDfile   Computed 3D by Vconf -m prep SDfile
Find this compound or compounds like it in BindingDB:
Activity Spreadsheet -- Enzyme Inhibition Constant Data from BindingDB
Found 1 hit for monomerid = 248318
TargetTransient receptor potential M8 protein(Canis lupus familiaris (Dog))
Janssen Pharmaceutica
US Patent
LigandPNGBDBM248318(US9434711, 171)
Affinity DataIC50:  19.3nMT: 2°C. Assay description: The functional activity of compounds of the formula (I) was determined by measuring changes in intracellular calcium concentration using a Ca2+-sensi...
Ligand InfoPC cidPC sid
In DepthDetails US Patent