BDBM248510 US9434711, 404
SMILES CCCN(c1sc2ccccc2c1C)S(=O)(=O)c1ccc(cc1)C(O)=O
InChI Key InChIKey=PVPPDFYEOYBGCT-UHFFFAOYSA-N
Data  1 IC50
  Tab Delimited (TSV)   2D SDfile   Computed 3D by Vconf -m prep SDfile
Find this compound or compounds like it in BindingDB:
Activity Spreadsheet -- Enzyme Inhibition Constant Data from BindingDB
Found 1 hit for monomerid = 248510
TargetTransient receptor potential M8 protein(Canis lupus familiaris (Dog))
Janssen Pharmaceutica
US Patent
LigandPNGBDBM248510(US9434711, 404)
Affinity DataIC50:  53nMT: 2°C. Assay description: The functional activity of compounds of the formula (I) was determined by measuring changes in intracellular calcium concentration using a Ca2+-sensi...
Ligand InfoPC cidPC sid
In DepthDetails US Patent