BDBM248825 US9434711, 795
SMILES Cc1c(sc2ccccc12)N(Cc1ccc(OC(F)(F)F)cc1)S(=O)(=O)CCC(O)=O
InChI Key InChIKey=WZOXXVFDPVXDBR-UHFFFAOYSA-N
Data  1 IC50
  Tab Delimited (TSV)   2D SDfile   Computed 3D by Vconf -m prep SDfile
Find this compound or compounds like it in BindingDB:
Activity Spreadsheet -- Enzyme Inhibition Constant Data from BindingDB
Found 1 hit for monomerid = 248825
TargetTransient receptor potential M8 protein(Canis lupus familiaris (Dog))
Janssen Pharmaceutica
US Patent
LigandPNGBDBM248825(US9434711, 795)
Affinity DataIC50:  24.6nMT: 2°C. Assay description: The functional activity of compounds of the formula (I) was determined by measuring changes in intracellular calcium concentration using a Ca2+-sensi...
Ligand InfoPC cidPC sid
In DepthDetails US Patent