BDBM24884 2,3,5-trisubstituted pyridine, 3::9-[1-({4-[3-phenyl-5-(1H-1,2,3,4-tetrazol-5-yl)pyridin-2-yl]phenyl}methyl)piperidin-4-yl]-9H-purin-6-amine
SMILES Nc1ncnc2n(cnc12)C1CCN(Cc2ccc(cc2)-c2ncc(cc2-c2ccccc2)-c2nnn[nH]2)CC1
InChI Key InChIKey=IZQMTAROJNRODE-UHFFFAOYSA-N
Data  3 IC50
  Tab Delimited (TSV)   2D SDfile   Computed 3D by Vconf -m prep SDfile
Find this compound or compounds like it in BindingDB:
Activity Spreadsheet -- Enzyme Inhibition Constant Data from BindingDB
Found 3 hits for monomerid = 24884
TargetRAC-alpha serine/threonine-protein kinase(Homo sapiens (Human))
Merck Research Laboratories
LigandPNGBDBM24884(2,3,5-trisubstituted pyridine, 3 | 9-[1-({4-[3-phe...)
Affinity DataIC50:  210nMpH: 7.5 T: 2°C. Assay description: Purified recombinant human Akt kinase was monitored for kinase activity in the presence or absence of inhibitors in a 96-well format. Detection was d...
In DepthDetails ArticlePubMed
TargetRAC-gamma serine/threonine-protein kinase(Homo sapiens (Human))
Merck Research Laboratories
LigandPNGBDBM24884(2,3,5-trisubstituted pyridine, 3 | 9-[1-({4-[3-phe...)
Affinity DataIC50: >5.00E+4nMpH: 7.5 T: 2°C. Assay description: Purified recombinant human Akt kinase was monitored for kinase activity in the presence or absence of inhibitors in a 96-well format. Detection was d...
In DepthDetails ArticlePubMed
TargetRAC-beta serine/threonine-protein kinase(Homo sapiens (Human))
Merck Research Laboratories
LigandPNGBDBM24884(2,3,5-trisubstituted pyridine, 3 | 9-[1-({4-[3-phe...)
Affinity DataIC50:  105nMpH: 7.5 T: 2°C. Assay description: Purified recombinant human Akt kinase was monitored for kinase activity in the presence or absence of inhibitors in a 96-well format. Detection was d...
In DepthDetails ArticlePubMed