BDBM24891 1-[1-({4-[5-(5-amino-1,3,4-thiadiazol-2-yl)-3-phenylpyridin-2-yl]phenyl}methyl)piperidin-4-yl]-1H,2H,3H-imidazo[4,5-b]pyridin-2-one::2,3,5-trisubstituted pyridine, 10g
SMILES Nc1nnc(s1)-c1cnc(-c2ccc(CN3CCC(CC3)n3c4cccnc4[nH]c3=O)cc2)c(c1)-c1ccccc1
InChI Key InChIKey=FLLYSDWXMXBDLY-UHFFFAOYSA-N
Data  2 IC50
  Tab Delimited (TSV)   2D SDfile   Computed 3D by Vconf -m prep SDfile
Find this compound or compounds like it in BindingDB:
Activity Spreadsheet -- Enzyme Inhibition Constant Data from BindingDB
Found 2 hits for monomerid = 24891
TargetRAC-beta serine/threonine-protein kinase(Homo sapiens (Human))
Merck Research Laboratories
LigandPNGBDBM24891(1-[1-({4-[5-(5-amino-1,3,4-thiadiazol-2-yl)-3-phen...)
Affinity DataIC50:  73nMpH: 7.5 T: 2°C. Assay description: Purified recombinant human Akt kinase was monitored for kinase activity in the presence or absence of inhibitors in a 96-well format. Detection was d...
In DepthDetails ArticlePubMed
TargetRAC-alpha serine/threonine-protein kinase(Homo sapiens (Human))
Merck Research Laboratories
LigandPNGBDBM24891(1-[1-({4-[5-(5-amino-1,3,4-thiadiazol-2-yl)-3-phen...)
Affinity DataIC50:  434nMpH: 7.5 T: 2°C. Assay description: Purified recombinant human Akt kinase was monitored for kinase activity in the presence or absence of inhibitors in a 96-well format. Detection was d...
In DepthDetails ArticlePubMed