BDBM24896 1-[1-({4-[5-(1,2,4-oxadiazol-3-yl)-3-phenylpyridin-2-yl]phenyl}methyl)piperidin-4-yl]-1H-pyrazolo[3,4-d]pyrimidin-4-amine::2,3,5-trisubstituted pyridine, 13d
SMILES Nc1ncnc2n(ncc12)C1CCN(Cc2ccc(cc2)-c2ncc(cc2-c2ccccc2)-c2ncon2)CC1
InChI Key InChIKey=SKBAKRCESRVMPS-UHFFFAOYSA-N
Data  2 IC50
  Tab Delimited (TSV)   2D SDfile   Computed 3D by Vconf -m prep SDfile
Find this compound or compounds like it in BindingDB:
Activity Spreadsheet -- Enzyme Inhibition Constant Data from BindingDB
Found 2 hits for monomerid = 24896
TargetRAC-beta serine/threonine-protein kinase(Homo sapiens (Human))
Merck Research Laboratories
LigandPNGBDBM24896(1-[1-({4-[5-(1,2,4-oxadiazol-3-yl)-3-phenylpyridin...)
Affinity DataIC50:  121nMpH: 7.5 T: 2°C. Assay description: Purified recombinant human Akt kinase was monitored for kinase activity in the presence or absence of inhibitors in a 96-well format. Detection was d...
In DepthDetails ArticlePubMed
TargetRAC-alpha serine/threonine-protein kinase(Homo sapiens (Human))
Merck Research Laboratories
LigandPNGBDBM24896(1-[1-({4-[5-(1,2,4-oxadiazol-3-yl)-3-phenylpyridin...)
Affinity DataIC50:  180nMpH: 7.5 T: 2°C. Assay description: Purified recombinant human Akt kinase was monitored for kinase activity in the presence or absence of inhibitors in a 96-well format. Detection was d...
In DepthDetails ArticlePubMed