BDBM249018 US9434725, 249
SMILES C[C@@]1(O)CNCCN(C1)c1cccc(n1)-n1ncc2cnc(cc12)-c1cnn(CC(F)(F)F)c1
InChI Key InChIKey=GXDSAAYOXDQSQT-OAQYLSRUSA-N
Data  3 KI
  Tab Delimited (TSV)   2D SDfile   Computed 3D by Vconf -m prep SDfile
Find this compound or compounds like it in BindingDB:
Activity Spreadsheet -- Enzyme Inhibition Constant Data from BindingDB
Found 3 hits for monomerid = 249018
TargetSerine/threonine-protein kinase pim-1(Homo sapiens (Human))
F. Hoffmann-La Roche
US Patent
LigandPNGBDBM249018(US9434725, 249)
Affinity DataKi:  2.16nM ΔG°:  -11.8kcal/molepH: 7.2 T: 2°C. Assay description: PIM-1, -2, and -3 enzymes were generated as fusion proteins expressed in bacteria and purified by IMAC column chromatography (Sun, X., Chiu, J. F., a...
Ligand InfoPC cidPC sid
In DepthDetails US Patent
TargetSerine/threonine-protein kinase pim-3(Homo sapiens (Human))
F. Hoffmann-La Roche
US Patent
LigandPNGBDBM249018(US9434725, 249)
Affinity DataKi:  3.09nM ΔG°:  -11.6kcal/molepH: 7.2 T: 2°C. Assay description: PIM-1, -2, and -3 enzymes were generated as fusion proteins expressed in bacteria and purified by IMAC column chromatography (Sun, X., Chiu, J. F., a...
Ligand InfoPC cidPC sid
In DepthDetails US Patent
TargetSerine/threonine-protein kinase pim-2(Homo sapiens (Human))
F. Hoffmann-La Roche
US Patent
LigandPNGBDBM249018(US9434725, 249)
Affinity DataKi:  16.8nM ΔG°:  -10.6kcal/molepH: 7.2 T: 2°C. Assay description: PIM-1, -2, and -3 enzymes were generated as fusion proteins expressed in bacteria and purified by IMAC column chromatography (Sun, X., Chiu, J. F., a...
Ligand InfoPC cidPC sid
In DepthDetails US Patent