BDBM25003 4-[2-(4-amino-1,2,5-oxadiazol-3-yl)-7-(3-aminopropoxy)-1-ethyl-1H-imidazo[4,5-c]pyridin-4-yl]-2-methylbut-3-yn-2-ol::oxadiazole-containing compound, 12b
SMILES CCn1c(nc2c(ncc(OCCCN)c12)C#CC(C)(C)O)-c1nonc1N
InChI Key InChIKey=YSASGHSLMIIWAY-UHFFFAOYSA-N
Data  4 IC50
  Tab Delimited (TSV)   2D SDfile   Computed 3D by Vconf -m prep SDfile
Find this compound or compounds like it in BindingDB:
Activity Spreadsheet -- Enzyme Inhibition Constant Data from BindingDB
Found 4 hits for monomerid = 25003
TargetRAC-alpha serine/threonine-protein kinase(Homo sapiens (Human))
Glaxosmithkline
LigandPNGBDBM25003(4-[2-(4-amino-1,2,5-oxadiazol-3-yl)-7-(3-aminoprop...)
Affinity DataIC50:  6nMpH: 7.5 T: 2°C. Assay description: IC50 is the inhibitor concentration, which inhibits 50% of kinase activity that catalyzes the transfer of the terminal phosphate from radiolabeled AT...
In DepthDetails ArticlePubMed
TargetRibosomal protein S6 kinase alpha-1(Homo sapiens (Human))
Glaxosmithkline
LigandPNGBDBM25003(4-[2-(4-amino-1,2,5-oxadiazol-3-yl)-7-(3-aminoprop...)
Affinity DataIC50:  1.26E+3nM. Assay description: IC50 is the inhibitor concentration, which inhibits 50% of kinase activity that catalyzes the transfer of the terminal phosphate from radiolabeled AT...
In DepthDetails ArticlePubMed
TargetRho-associated protein kinase 1(Homo sapiens (Human))
Glaxosmithkline
LigandPNGBDBM25003(4-[2-(4-amino-1,2,5-oxadiazol-3-yl)-7-(3-aminoprop...)
Affinity DataIC50:  501nM. Assay description: IC50 is the inhibitor concentration, which inhibits 50% of kinase activity that catalyzes the transfer of the terminal phosphate from radiolabeled AT...
In DepthDetails ArticlePubMed
TargetRibosomal protein S6 kinase alpha-5(Homo sapiens (Human))
Glaxosmithkline
LigandPNGBDBM25003(4-[2-(4-amino-1,2,5-oxadiazol-3-yl)-7-(3-aminoprop...)
Affinity DataIC50:  1.59E+4nM. Assay description: IC50 is the inhibitor concentration, which inhibits 50% of kinase activity that catalyzes the transfer of the terminal phosphate from radiolabeled AT...
In DepthDetails ArticlePubMed