BDBM250957 US9452986, 261
SMILES FC(F)(F)c1ccc(Oc2ccc3nc(ccc3c2)C(=O)N2CCN(CC2)C2CC2)nc1
InChI Key InChIKey=VAUVOXYVYWZDJU-UHFFFAOYSA-N
Data  1 IC50
  Tab Delimited (TSV)   2D SDfile   Computed 3D by Vconf -m prep SDfile
Find this compound or compounds like it in BindingDB:
Activity Spreadsheet -- Enzyme Inhibition Constant Data from BindingDB
Found 1 hit for monomerid = 250957
TargetSodium channel protein type 9 subunit alpha(Homo sapiens (Human))
Abbvie
US Patent
LigandPNGBDBM250957(US9452986, 261)
Affinity DataIC50:  6.31E+3nMT: 2°C. Assay description: Two days prior to the experiment, frozen HEK293 cells stably expressing recombinant human Nav1.7 were quickly thawed and plated at 25,000 cells/well ...
Ligand InfoPC cidPC sid
In DepthDetails US Patent