BDBM251236 US9452986, 540
SMILES FC(F)(F)c1ccc(Oc2ccc3nc(ccc3c2)C(=O)N2CCC(CC2)N2CC(F)(F)C2)nc1
InChI Key InChIKey=DNJUBUSKKRFBCH-UHFFFAOYSA-N
Data  1 IC50
  Tab Delimited (TSV)   2D SDfile   Computed 3D by Vconf -m prep SDfile
Find this compound or compounds like it in BindingDB:
Activity Spreadsheet -- Enzyme Inhibition Constant Data from BindingDB
Found 1 hit for monomerid = 251236
TargetSodium channel protein type 9 subunit alpha(Homo sapiens (Human))
Abbvie
US Patent
LigandPNGBDBM251236(US9452986, 540)
Affinity DataIC50:  4.03E+3nMT: 2°C. Assay description: Two days prior to the experiment, frozen HEK293 cells stably expressing recombinant human Nav1.7 were quickly thawed and plated at 25,000 cells/well ...
Ligand InfoPC cidPC sid
In DepthDetails US Patent