BDBM251356 US9452990, 36
SMILES COc1cc2c(N)nc(nc2c(F)c1OC)N1CCN(CC1)C(=O)C[C@@H](N)c1cccs1
InChI Key InChIKey=XIUXOSPEFHBIBM-CYBMUJFWSA-N
Data  1 IC50
  Tab Delimited (TSV)   2D SDfile   Computed 3D by Vconf -m prep SDfile
Find this compound or compounds like it in BindingDB:
Activity Spreadsheet -- Enzyme Inhibition Constant Data from BindingDB
Found 1 hit for monomerid = 251356
TargetCobra venom factor/Complement factor B/Complement factor D(Naja kaouthia (Monocled cobra) (Naja siamensis))
Novartis
US Patent
LigandPNGBDBM251356(US9452990, 36)
Affinity DataIC50:  190nMpH: 7.4 T: 2°C. Assay description: CVF-Bb complex prepared from purified cobra venom factor (1 μM), recombinant human complement factor B (expressed in drosophila cells and purifi...
Ligand InfoPC cidPC sid
In DepthDetails US Patent