BDBM251594 US9453031, 17
SMILES CS(=O)(=O)C1(CCOCC1)c1nc(nc2N3CCOCC3COc12)-c1cc(F)cc2[nH]ccc12
InChI Key
Data  3 IC50
  Tab Delimited (TSV)   2D SDfile   Computed 3D by Vconf -m prep SDfile
Find this compound or compounds like it in BindingDB:
Activity Spreadsheet -- Enzyme Inhibition Constant Data from BindingDB
Found 3 hits for monomerid = 251594
TargetPhosphatidylinositol 3-kinase regulatory subunit alpha/4,5-bisphosphate 3-kinase catalytic subunit alpha isoform(Homo sapiens (Human))
FundacióN Centro Nacional De Investigaciones OncolóGicas Carlos Iii
US Patent
LigandPNGBDBM251594(US9453031, 17)
Affinity DataIC50:  6.00E+3nMpH: 7.5 T: 2°C. Assay description: The kinase activity was measured by using the commercial ADP Hunter Plus assay available from DiscoveRx (#33-016), which is a homogeneous assay to me...
Ligand InfoPC cidPC sid
In DepthDetails US Patent
TargetDNA-dependent protein kinase catalytic subunit(Homo sapiens (Human))
FundacióN Centro Nacional De Investigaciones OncolóGicas Carlos Iii
US Patent
LigandPNGBDBM251594(US9453031, 17)
Affinity DataIC50:  1.00E+4nMpH: 7.5 T: 2°C. Assay description: The kinase activity was measured by using the commercial ADP Hunter Plus assay available from DiscoveRx (#90-0083), which is a homogeneous assay to m...
Ligand InfoPC cidPC sid
In DepthDetails US Patent
TargetSerine/threonine-protein kinase mTOR [1360-2549](Homo sapiens (Human))
FundacióN Centro Nacional De Investigaciones OncolóGicas Carlos Iii
US Patent
LigandPNGBDBM251594(US9453031, 17)
Affinity DataIC50:  2.62E+3nMpH: 7.5 T: 2°C. Assay description: The enzymatic mTOR activity was measured using a LanthaScreen kinase activity assay (Invitrogen). The enzyme was purchased from Invitrogen (PV4754), ...
Ligand InfoPC cidPC sid
In DepthDetails US Patent