BDBM25161 N-(cyclohexylmethyl)-5-(2,2,2-trifluoroacetyl)thiophene-2-carboxamide::thiophene derivative, 3g
SMILES FC(F)(F)C(=O)c1ccc(s1)C(=O)NCC1CCCCC1
InChI Key InChIKey=VLHNZHDVXTZZKS-UHFFFAOYSA-N
Data  5 IC50
  Tab Delimited (TSV)   2D SDfile   Computed 3D by Vconf -m prep SDfile
Find this compound or compounds like it in BindingDB:
Activity Spreadsheet -- Enzyme Inhibition Constant Data from BindingDB
Found 5 hits for monomerid = 25161
TargetHistone deacetylase 1(Homo sapiens (Human))
Irbm/Merck Research Laboratories
LigandPNGBDBM25161(N-(cyclohexylmethyl)-5-(2,2,2-trifluoroacetyl)thio...)
Affinity DataIC50:  2.90E+3nMpH: 8.0 T: 2°C. Assay description: The Fluor-de-Lys HDAC activity assay kit (Biomol) was used. Purified recombinant HDAC enzyme was incubated with Fluor-de-Lys substrate in the presenc...
Ligand InfoPC cidPC sid
In DepthDetails ArticlePubMed
TargetHistone deacetylase 3(Homo sapiens (Human))
Irbm/Merck Research Laboratories
LigandPNGBDBM25161(N-(cyclohexylmethyl)-5-(2,2,2-trifluoroacetyl)thio...)
Affinity DataIC50:  3.10E+3nMT: 2°C. Assay description: The Fluor-de-Lys HDAC activity assay kit (Biomol) was used. Purified recombinant HDAC enzyme was incubated with Fluor-de-Lys substrate in the presenc...
Ligand InfoPC cidPC sid
In DepthDetails ArticlePubMed
TargetHistone deacetylase 6(Homo sapiens (Human))
Irbm/Merck Research Laboratories
LigandPNGBDBM25161(N-(cyclohexylmethyl)-5-(2,2,2-trifluoroacetyl)thio...)
Affinity DataIC50:  460nMT: 2°C. Assay description: The Fluor-de-Lys HDAC activity assay kit (Biomol) was used. Purified recombinant HDAC enzyme was incubated with Fluor-de-Lys substrate in the presenc...
Ligand InfoPC cidPC sid
In DepthDetails ArticlePubMed
TargetHistone deacetylase 4(Homo sapiens (Human))
Irbm/Merck Research Laboratories
LigandPNGBDBM25161(N-(cyclohexylmethyl)-5-(2,2,2-trifluoroacetyl)thio...)
Affinity DataIC50:  400nMT: 2°C. Assay description: The Fluor-de-Lys HDAC activity assay kit (Biomol) was used. Purified recombinant HDAC enzyme was incubated with Fluor-de-Lys substrate in the presenc...
Ligand InfoPC cidPC sid
In DepthDetails ArticlePubMed
TargetHistone deacetylase 4 [653-1084,H976Y](Homo sapiens (Human))
Irbm/Merck Research Laboratories
LigandPNGBDBM25161(N-(cyclohexylmethyl)-5-(2,2,2-trifluoroacetyl)thio...)
Affinity DataIC50:  350nMT: 2°C. Assay description: The Fluor-de-Lys HDAC activity assay kit (Biomol) was used. Purified recombinant HDAC enzyme was incubated with Fluor-de-Lys substrate in the presenc...
Ligand InfoPC cidPC sid
In DepthDetails ArticlePubMed