BDBM251687 US10100018, Example 23::US9464060, 23
SMILES Cc1ccccc1Oc1ccc(cc1)C(=O)N(CC1CCC1)Cc1ccc(cc1)C(O)=O
InChI Key InChIKey=DYBZGLVYMXXJHF-UHFFFAOYSA-N
Data  2 IC50
  Tab Delimited (TSV)   2D SDfile   Computed 3D by Vconf -m prep SDfile
Find this compound or compounds like it in BindingDB:
Activity Spreadsheet -- Enzyme Inhibition Constant Data from BindingDB
Found 2 hits for monomerid = 251687
TargetLysophosphatidic acid receptor 1(Homo sapiens (Human))
Takeda Pharmaceutical
US Patent
LigandPNGBDBM251687(US10100018, Example 23 | US9464060, 23)
Affinity DataIC50:  44nMT: 2°C. Assay description: Engagement of the LPA1 receptor by its ligand, oleoyl-L-α-lysophosphatidic acid (LPA), leads to the release of intracellular stores of calcium i...
Ligand InfoPC cidPC sid
In DepthDetails US Patent
TargetLysophosphatidic acid receptor 5(Homo sapiens (Human))
Takeda Pharmaceutical
US Patent
LigandPNGBDBM251687(US10100018, Example 23 | US9464060, 23)
Affinity DataIC50:  44nMT: 2°C. Assay description: Engagement of the LPA5 receptor by its ligand, oleoyl-L-α-lysophosphatidic acid (LPA), leads to the release of intracellular stores of calcium into ...
Ligand InfoPC cidPC sid
In DepthDetails US Patent