BDBM251733 US10100018, Example 69::US9464060, 69
SMILES COc1ccccc1Oc1ccc(nc1)C(=O)N(CC1CC1)Cc1ccc(cc1)C(O)=O
InChI Key InChIKey=AXNASFMPKJGIGO-UHFFFAOYSA-N
Data  4 IC50
  Tab Delimited (TSV)   2D SDfile   Computed 3D by Vconf -m prep SDfile
Find this compound or compounds like it in BindingDB:
Activity Spreadsheet -- Enzyme Inhibition Constant Data from BindingDB
Found 4 hits for monomerid = 251733
TargetLysophosphatidic acid receptor 5(Homo sapiens (Human))
Takeda Pharmaceutical
US Patent
LigandPNGBDBM251733(US10100018, Example 69 | US9464060, 69)
Affinity DataIC50:  8nMT: 2°C. Assay description: Engagement of the LPA5 receptor by its ligand, oleoyl-L-α-lysophosphatidic acid (LPA), leads to the release of intracellular stores of calcium into ...
Ligand InfoPC cidPC sid
In DepthDetails US Patent
TargetLysophosphatidic acid receptor 1(Homo sapiens (Human))
Takeda Pharmaceutical
US Patent
LigandPNGBDBM251733(US10100018, Example 69 | US9464060, 69)
Affinity DataIC50:  12nMT: 2°C. Assay description: Engagement of the LPA1 receptor by its ligand, oleoyl-L-α-lysophosphatidic acid (LPA), leads to the release of intracellular stores of calcium i...
Ligand InfoPC cidPC sid
In DepthDetails US Patent
TargetLysophosphatidic acid receptor 1(Homo sapiens (Human))
Takeda Pharmaceutical
US Patent
LigandPNGBDBM251733(US10100018, Example 69 | US9464060, 69)
Affinity DataIC50:  8nMT: 2°C. Assay description: Engagement of the LPA1 receptor by its ligand, oleoyl-L-α-lysophosphatidic acid (LPA), leads to the release of intracellular stores of calcium i...
Ligand InfoPC cidPC sid
In DepthDetails US Patent
TargetLysophosphatidic acid receptor 1(Homo sapiens (Human))
Takeda Pharmaceutical
US Patent
LigandPNGBDBM251733(US10100018, Example 69 | US9464060, 69)
Affinity DataIC50:  12nMT: 2°C. Assay description: Engagement of the LPA1 receptor by its ligand, oleoyl-L-α-lysophosphatidic acid (LPA), leads to the release of intracellular stores of calcium into ...
Ligand InfoPC cidPC sid
In DepthDetails US Patent