BDBM25279 BPH-608::bisphosphonate, 31::{1-hydroxy-2-[3-(3-phenylphenyl)phenyl]-1-phosphonoethyl}phosphonic acid
SMILES OC(Cc1cccc(c1)-c1cccc(c1)-c1ccccc1)(P(O)(O)=O)P(O)(O)=O
InChI Key InChIKey=YXQQNSYZOQHKHD-UHFFFAOYSA-N
Data  2 KI  4 IC50
PDB links: 1 PDB ID matches this monomer.
  Tab Delimited (TSV)   2D SDfile   Computed 3D by Vconf -m prep SDfile
Find this compound or compounds like it in BindingDB:
Activity Spreadsheet -- Enzyme Inhibition Constant Data from BindingDB
Found 6 hits for monomerid = 25279
TargetGeranylgeranyl pyrophosphate synthase BTS1(Saccharomyces cerevisiae (Yeast))
Institute Of Biological Chemistry
Curated by ChEMBL
LigandPNGBDBM25279(BPH-608 | bisphosphonate, 31 | {1-hydroxy-2-[3-(3-...)
Affinity DataKi:  30nM. Assay description: Binding affinity to Saccharomyces cerevisiae GGPPS
In DepthDetails ArticlePubMed
TargetGeranylgeranyl pyrophosphate synthase(Homo sapiens (Human))
Institute Of Biological Chemistry
Curated by ChEMBL
LigandPNGBDBM25279(BPH-608 | bisphosphonate, 31 | {1-hydroxy-2-[3-(3-...)
Affinity DataKi:  60nM. Assay description: Binding affinity to human GGPPS
In DepthDetails ArticlePubMed
TargetGeranylgeranyl pyrophosphate synthase(Homo sapiens (Human))
Institute Of Biological Chemistry
Curated by ChEMBL
LigandPNGBDBM25279(BPH-608 | bisphosphonate, 31 | {1-hydroxy-2-[3-(3-...)
Affinity DataIC50:  2.10E+3nM. Assay description: Inhibition of human GGPPS
In DepthDetails ArticlePubMed
TargetDecaprenyl diphosphate synthase(Mycobacterium tuberculosis H37Rv)
University Of California San Diego
LigandPNGBDBM25279(BPH-608 | bisphosphonate, 31 | {1-hydroxy-2-[3-(3-...)
Affinity DataIC50:  1.80E+4nMpH: 7.5Assay Description:We screened an in-house library of 53 compounds using trans-FPP as substrate. Briefly, the condensation of IPP and GPP, FPP, or cis-FPP catalyzed by ...
In DepthDetails ArticlePubMed
TargetGeranylgeranyl pyrophosphate synthase(Homo sapiens (Human))
Institute Of Biological Chemistry
Curated by ChEMBL
LigandPNGBDBM25279(BPH-608 | bisphosphonate, 31 | {1-hydroxy-2-[3-(3-...)
Affinity DataIC50:  2.14E+3nMpH: 7.0 T: 2°C. Assay description: The inhibitory activity of each test compound was evaluated by monitoring the formation of [14C]GGPP from FPP, using [14C]IPP as the substrate. To co...
In DepthDetails ArticlePubMed
TargetGeranylgeranyl pyrophosphate synthase BTS1(Saccharomyces cerevisiae (Yeast))
Institute Of Biological Chemistry
Curated by ChEMBL
LigandPNGBDBM25279(BPH-608 | bisphosphonate, 31 | {1-hydroxy-2-[3-(3-...)
Affinity DataIC50:  70nM. Assay description: Inhibition of Saccharomyces cerevisiae GGPPS
In DepthDetails ArticlePubMed