BDBM252981 US9469608, 8-8
SMILES NCc1ccc(Cl)cc1CNC(=O)[C@@H]1CCCN1C(=O)c1cc(c[nH]1)C(=O)c1cccnc1
InChI Key
Data  1 KI
  Tab Delimited (TSV)   2D SDfile   Computed 3D by Vconf -m prep SDfile
Find this compound or compounds like it in BindingDB:
Activity Spreadsheet -- Enzyme Inhibition Constant Data from BindingDB
Found 1 hit for monomerid = 252981
TargetProthrombin(Homo sapiens (Human))
Merck Sharp & Dohme
US Patent
LigandPNGBDBM252981(US9469608, 8-8)
Affinity DataKi:  18nMpH: 7.4Assay Description:Relevant in vitro assays are referenced in Morrissette, et al., Bioorg. Med. Chem. Lett. 2004, 14, 4161-4164 and described in Lewis, et al. Thromb. R...
Ligand InfoPC cidPC sid
In DepthDetails US Patent