BDBM253484 US9458171, 444
SMILES OC(=O)[C@H]1CC[C@@H](CC1)C(=O)N1CCC(C1)(c1ccc(cc1)C(F)(C(F)(F)F)C(F)(F)F)S(=O)(=O)c1cccc(C=C)c1
InChI Key InChIKey=QBOPOTMHSKVTPM-NMUBWLRRSA-N
Data  1 IC50
  Tab Delimited (TSV)   2D SDfile   Computed 3D by Vconf -m prep SDfile
Find this compound or compounds like it in BindingDB:
Activity Spreadsheet -- Enzyme Inhibition Constant Data from BindingDB
Found 1 hit for monomerid = 253484
TargetNuclear receptor ROR-gamma [262-507](Homo sapiens (Human))
Bristol-Myers Squibb
US Patent
LigandPNGBDBM253484(US9458171, 444)
Affinity DataIC50:  220nMT: 2°C. Assay description: The binding of potential ligands to RORγ is measured by competition with [3H] 25-hydroxycholesterol (Perkin Elmer NET674250UC) using a scintill...
Ligand InfoPC cidPC sid
In DepthDetails US Patent