BDBM253635 US9701672, 66
SMILES CCc1cnc(s1)C1=C(c2nnn[nH]2)C(=O)N[C@@](C1)(c1ccc(OCCCCCC(F)(F)F)cc1F)C(F)(F)F
InChI Key
Data  1 IC50
  Tab Delimited (TSV)   2D SDfile   Computed 3D by Vconf -m prep SDfile
Find this compound or compounds like it in BindingDB:
Activity Spreadsheet -- Enzyme Inhibition Constant Data from BindingDB
Found 1 hit for monomerid = 253635
TargetAlpha-1,6-mannosyl-glycoprotein 2-beta-N-acetylglucosaminyltransferase(Homo sapiens (Human))
Bristol-Myers Squibb
US Patent
LigandPNGBDBM253635(US9701672, 66)
Affinity DataIC50:  0.5nMpH: 7.4Assay Description:The MGAT enzyme reactions were performed in Corning FALCONŽ 96-well polypropylene plates, in a total volume of 60 μL of 50 mM potassium phosphat...
Ligand InfoPC cidPC sid
In DepthDetails US Patent