BDBM253636 (S)-4-(5-Methylthiophen-2-yl)-2-oxo-6-(4-(4,4,4-trifluorobutoxy)phenyl)-6-(trifluoromethyl)-1,2,5,6-tetrahydropyridine-3-carbonitrile::US9701672, 67
SMILES Cc1ccc(s1)C1=C(C#N)C(=O)N[C@@](C1)(c1ccc(OCCCC(F)(F)F)cc1)C(F)(F)F
InChI Key InChIKey=LIPJKWFTNGUMEX-FQEVSTJZSA-N
Data  1 IC50
  Tab Delimited (TSV)   2D SDfile   Computed 3D by Vconf -m prep SDfile
Find this compound or compounds like it in BindingDB:
Activity Spreadsheet -- Enzyme Inhibition Constant Data from BindingDB
Found 1 hit for monomerid = 253636
TargetAlpha-1,6-mannosyl-glycoprotein 2-beta-N-acetylglucosaminyltransferase(Homo sapiens (Human))
Bristol-Myers Squibb
US Patent
LigandPNGBDBM253636((S)-4-(5-Methylthiophen-2-yl)-2-oxo-6-(4-(4,4,4-tr...)
Affinity DataIC50:  97.6nMpH: 7.4Assay Description:The MGAT enzyme reactions were performed in Corning FALCONŽ 96-well polypropylene plates, in a total volume of 60 μL of 50 mM potassium phosphat...
Ligand InfoPC cidPC sid
In DepthDetails US Patent