BDBM253815 US9459250, E20
SMILES COc1ccc(Cl)c(OC)c1C(=O)N[C@H]1CCCc2ccccc12
InChI Key InChIKey=FBARJSJUBGXSRC-HNNXBMFYSA-N
Data  1 EC50
  Tab Delimited (TSV)   2D SDfile   Computed 3D by Vconf -m prep SDfile
Find this compound or compounds like it in BindingDB:
Activity Spreadsheet -- Enzyme Inhibition Constant Data from BindingDB
Found 1 hit for monomerid = 253815
TargetTaste receptor type 1 member 2/3(Homo sapiens (Human))
Senomyx
US Patent
LigandPNGBDBM253815(US9459250, E20)
Affinity DataEC50:  4.13E+3nMT: 2°C. Assay description: Immunoassays also often use a labeling agent to specifically bind to and label the complex formed by the antibody and antigen. The labeling agent may...
Ligand InfoPC cidPC sid
In DepthDetails US Patent