BDBM253886 US9459250, E91
SMILES Clc1cccc(Cl)c1C(=O)Nc1ccc(cc1)C#N
InChI Key InChIKey=KYXIYCVFAJYFRB-UHFFFAOYSA-N
Data  1 EC50
  Tab Delimited (TSV)   2D SDfile   Computed 3D by Vconf -m prep SDfile
Find this compound or compounds like it in BindingDB:
Activity Spreadsheet -- Enzyme Inhibition Constant Data from BindingDB
Found 1 hit for monomerid = 253886
TargetTaste receptor type 1 member 2/3(Homo sapiens (Human))
Senomyx
US Patent
LigandPNGBDBM253886(US9459250, E91)
Affinity DataEC50:  2.74E+3nMT: 2°C. Assay description: Immunoassays also often use a labeling agent to specifically bind to and label the complex formed by the antibody and antigen. The labeling agent may...
In DepthDetails US Patent