BDBM254566 US10214477, Example 25::US9469597, 25::US9670136, 25 4-morpholino-N-((trans)-2-phenylcyclopropyl)cyclohexanamine
SMILES C1[C@H](NC2CCC(CC2)N2CCOCC2)[C@H]1c1ccccc1
InChI Key InChIKey=KELVXSSXVHPRDE-GMNCBBECSA-N
Data  9 IC50
  Tab Delimited (TSV)   2D SDfile   Computed 3D by Vconf -m prep SDfile
Find this compound or compounds like it in BindingDB:
Activity Spreadsheet -- Enzyme Inhibition Constant Data from BindingDB
Found 9 hits for monomerid = 254566
TargetAmine oxidase [flavin-containing] A(Homo sapiens (Human))
Oryzon Genomics
US Patent
LigandPNGBDBM254566(US10214477, Example 25 | US9469597, 25 | US9670136...)
Affinity DataIC50: >1.00E+5nMpH: 7.5 T: 2°C. Assay description: In order to monitor MAO enzymatic activities and/or their inhibition rate by inhibitor(s) of interest, a fluorescence-based (inhibitor)-screening ass...
Ligand InfoPC cidPC sid
In DepthDetails US Patent
TargetAmine oxidase [flavin-containing] B(Homo sapiens (Human))
Oryzon Genomics
US Patent
LigandPNGBDBM254566(US10214477, Example 25 | US9469597, 25 | US9670136...)
Affinity DataIC50:  1.00E+5nMpH: 7.5 T: 2°C. Assay description: In order to monitor MAO enzymatic activities and/or their inhibition rate by inhibitor(s) of interest, a fluorescence-based (inhibitor)-screening ass...
Ligand InfoPC cidPC sid
In DepthDetails US Patent
TargetGlutathione S-transferase P/Lysine-specific histone demethylase 1A [158-852](Homo sapiens (Human))
Oryzon Genomics
US Patent
LigandPNGBDBM254566(US10214477, Example 25 | US9469597, 25 | US9670136...)
Affinity DataIC50:  1.33E+3nMpH: 7.4 T: 2°C. Assay description: The compounds of the invention can be tested for their ability to inhibit LSD1. The ability of the compounds of the invention to inhibit LSD1 can be ...
Ligand InfoPC cidPC sid
In DepthDetails US Patent
TargetAmine oxidase [flavin-containing] A(Homo sapiens (Human))
Oryzon Genomics
US Patent
LigandPNGBDBM254566(US10214477, Example 25 | US9469597, 25 | US9670136...)
Affinity DataIC50: >1.00E+5nM. Assay description: Briefly, a fixed amount of MAO (0.25 μg for MAO-A and 0.5 μg for MAO-B) was incubated on ice for 15 minutes in the reaction buffer, in the ...
Ligand InfoPC cidPC sid
In DepthDetails US Patent
TargetLysine-specific histone demethylase 1A(Homo sapiens (Human))
Oryzon Genomics
US Patent
LigandPNGBDBM254566(US10214477, Example 25 | US9469597, 25 | US9670136...)
Affinity DataIC50:  1.33E+3nM. Assay description: Briefly, a fixed amount of LSD1 was incubated on ice for 15 minutes, in the absence and/or in the presence of at least eight 3-fold serial dilutions ...
Ligand InfoPC cidPC sid
In DepthDetails US Patent
TargetLysine-specific histone demethylase 1A(Homo sapiens (Human))
Oryzon Genomics
US Patent
LigandPNGBDBM254566(US10214477, Example 25 | US9469597, 25 | US9670136...)
Affinity DataIC50:  1.33E+3nMpH: 7.4 T: 2°C. Assay description: Briefly, a fixed amount of LSD1 was incubated on ice for 15 minutes, in the absence and/or in the presence of at least eight 3-fold serial dilutions ...
Ligand InfoPC cidPC sid
In DepthDetails US Patent
TargetAmine oxidase [flavin-containing] A(Homo sapiens (Human))
Oryzon Genomics
US Patent
LigandPNGBDBM254566(US10214477, Example 25 | US9469597, 25 | US9670136...)
Affinity DataIC50: >1.00E+5nM. Assay description: Briefly, a fixed amount of LSD1 was incubated on ice for 15 minutes, in the absence and/or in the presence of at least eight 3-fold serial dilutions ...
Ligand InfoPC cidPC sid
In DepthDetails US Patent
TargetAmine oxidase [flavin-containing] B(Homo sapiens (Human))
Oryzon Genomics
US Patent
LigandPNGBDBM254566(US10214477, Example 25 | US9469597, 25 | US9670136...)
Affinity DataIC50:  8.78E+6nM. Assay description: Briefly, a fixed amount of LSD1 was incubated on ice for 15 minutes, in the absence and/or in the presence of at least eight 3-fold serial dilutions ...
Ligand InfoPC cidPC sid
In DepthDetails US Patent
TargetAmine oxidase [flavin-containing] B(Homo sapiens (Human))
Oryzon Genomics
US Patent
LigandPNGBDBM254566(US10214477, Example 25 | US9469597, 25 | US9670136...)
Affinity DataIC50:  1.00E+5nM. Assay description: Briefly, a fixed amount of MAO (0.25 μg for MAO-A and 0.5 μg for MAO-B) was incubated on ice for 15 minutes in the reaction buffer, in the ...
Ligand InfoPC cidPC sid
In DepthDetails US Patent