BDBM254925 US9499542, 8::US9675594, 8
SMILES CN(C)Cc1ccc(cc1C)-c1ccnc2[nH]cc(C#N)c12
InChI Key InChIKey=MGZVMXARJNUNDE-UHFFFAOYSA-N
Data  2 IC50  2 EC50
  Tab Delimited (TSV)   2D SDfile   Computed 3D by Vconf -m prep SDfile
Find this compound or compounds like it in BindingDB:
Activity Spreadsheet -- Enzyme Inhibition Constant Data from BindingDB
Found 4 hits for monomerid = 254925
TargetLeucine-rich repeat serine/threonine-protein kinase 2 [G2019S](Homo sapiens (Human))
H. Lundbeck
US Patent
LigandPNGBDBM254925(US9499542, 8 | US9675594, 8)
Affinity DataIC50:  288nMpH: 8.5 T: 2°C. Assay description: LRRK2 kinase activity is measured using a LanthaScreen kinase activity assay available from Invitrogen (Life Technologies Corporation). The assay is ...
Ligand InfoPC cidPC sid
In DepthDetails US Patent
TargetLeucine-rich repeat serine/threonine-protein kinase 2 [970-2527](Homo sapiens (Human))
H. Lundbeck
US Patent
LigandPNGBDBM254925(US9499542, 8 | US9675594, 8)
Affinity DataEC50:  549nM. Assay description: In the assay, 1 nM LRRK2 WT or 250 pM LRRK2 G2019S kinase is incubated with the test compound (typically at 0 to 30 μM) for 30 minutes before th...
Ligand InfoPC cidPC sid
In DepthDetails US Patent
TargetLeucine-rich repeat serine/threonine-protein kinase 2 [970-2527,G2019S](Homo sapiens (Human))
H. Lundbeck
US Patent
LigandPNGBDBM254925(US9499542, 8 | US9675594, 8)
Affinity DataEC50:  288nM. Assay description: In the assay, 1 nM LRRK2 WT or 250 pM LRRK2 G2019S kinase is incubated with the test compound (typically at 0 to 30 μM) for 30 minutes before th...
Ligand InfoPC cidPC sid
In DepthDetails US Patent
TargetLeucine-rich repeat serine/threonine-protein kinase 2(Homo sapiens (Human))
H. Lundbeck
US Patent
LigandPNGBDBM254925(US9499542, 8 | US9675594, 8)
Affinity DataIC50:  549nMpH: 8.5 T: 2°C. Assay description: LRRK2 kinase activity is measured using a LanthaScreen kinase activity assay available from Invitrogen (Life Technologies Corporation). The assay is ...
Ligand InfoPC cidPC sid
In DepthDetails US Patent