BDBM255041 US9475813, 62
SMILES CCN1CN([C@H]2CC[C@H](CN(C)CC#N)CC2)c2c(cnc3[nH]ccc23)C1=O
InChI Key
Data  4 IC50
  Tab Delimited (TSV)   2D SDfile   Computed 3D by Vconf -m prep SDfile
Find this compound or compounds like it in BindingDB:
Activity Spreadsheet -- Enzyme Inhibition Constant Data from BindingDB
Found 4 hits for monomerid = 255041
TargetTyrosine-protein kinase JAK1(Homo sapiens (Human))
Nissan Chemical Industries
US Patent
LigandPNGBDBM255041(US9475813, 62)
Affinity DataIC50:  14nM. Assay description: The inhibitory activity of the compounds of the present invention against JAK was measured.The respective enzymes (JAK1, JAK2, JAK3 and Tyk2) were pu...
Ligand InfoPC cidPC sid
In DepthDetails US Patent
TargetNon-receptor tyrosine-protein kinase TYK2(Homo sapiens (Human))
Nissan Chemical Industries
US Patent
LigandPNGBDBM255041(US9475813, 62)
Affinity DataIC50:  700nM. Assay description: The inhibitory activity of the compounds of the present invention against JAK was measured.The respective enzymes (JAK1, JAK2, JAK3 and Tyk2) were pu...
Ligand InfoPC cidPC sid
In DepthDetails US Patent
TargetTyrosine-protein kinase JAK3(Homo sapiens (Human))
Nissan Chemical Industries
US Patent
LigandPNGBDBM255041(US9475813, 62)
Affinity DataIC50:  540nM. Assay description: The inhibitory activity of the compounds of the present invention against JAK was measured.The respective enzymes (JAK1, JAK2, JAK3 and Tyk2) were pu...
Ligand InfoPC cidPC sid
In DepthDetails US Patent
TargetTyrosine-protein kinase JAK2(Homo sapiens (Human))
Nissan Chemical Industries
US Patent
LigandPNGBDBM255041(US9475813, 62)
Affinity DataIC50:  260nM. Assay description: The inhibitory activity of the compounds of the present invention against JAK was measured.The respective enzymes (JAK1, JAK2, JAK3 and Tyk2) were pu...
Ligand InfoPC cidPC sid
In DepthDetails US Patent