BDBM255215 US9475817, 174
SMILES Cc1nc(sc1C(=O)Nc1cn2nc(ccc2n1)-c1c(nn(C)c1C1CCNCC1)-c1ccc(F)cc1)-c1cccnc1
InChI Key InChIKey=FYPOUGJEFCVZKH-UHFFFAOYSA-N
Data  2 IC50
  Tab Delimited (TSV)   2D SDfile   Computed 3D by Vconf -m prep SDfile
Find this compound or compounds like it in BindingDB:
Activity Spreadsheet -- Enzyme Inhibition Constant Data from BindingDB
Found 2 hits for monomerid = 255215
TargetCasein kinase I isoform delta(Homo sapiens (Human))
Bristol-Myers Squibb
US Patent
LigandPNGBDBM255215(US9475817, 174)
Affinity DataIC50:  2.5nMpH: 7.4 T: 2°C. Assay description: The kinase assay was performed in V-bottom 384-well plates. The final assay volume was 30 ul prepared from 15 ul additions of enzyme, substrates (flu...
Ligand InfoPC cidPC sid
In DepthDetails US Patent
TargetCasein kinase I isoform epsilon(Homo sapiens (Human))
Bristol-Myers Squibb
US Patent
LigandPNGBDBM255215(US9475817, 174)
Affinity DataIC50:  1.80nMpH: 7.4 T: 2°C. Assay description: The kinase assay was performed in V-bottom 384-well plates. The final assay volume was 30 ul prepared from 15 ul additions of enzyme, substrates (flu...
Ligand InfoPC cidPC sid
In DepthDetails US Patent