BDBM25523 2-[3-chloro-5-(6-{[(1S)-1-phenylethyl]amino}-1H-pyrazolo[4,3-c]pyridin-1-yl)phenyl]benzamide::2-amino-pyrazolopyridine, 39
SMILES C[C@H](Nc1cc2n(ncc2cn1)-c1cc(Cl)cc(c1)-c1ccccc1C(N)=O)c1ccccc1
InChI Key InChIKey=ARWOPUQEWAIZHZ-KRWDZBQOSA-N
Data  1 IC50
  Tab Delimited (TSV)   2D SDfile   Computed 3D by Vconf -m prep SDfile
Find this compound or compounds like it in BindingDB:
Activity Spreadsheet -- Enzyme Inhibition Constant Data from BindingDB
Found 1 hit for monomerid = 25523
TargetSerine/threonine-protein kinase PLK1(Homo sapiens (Human))
Sunesis Pharmaceuticals
LigandPNGBDBM25523(2-[3-chloro-5-(6-{[(1S)-1-phenylethyl]amino}-1H-py...)
Affinity DataIC50:  50nMpH: 7.2 T: 2°C. Assay description: An IMAP fluorescence polarization-based assay format (Molecular Devices) was used to determine the ability of compounds to inhibit the phosphorylatio...
In DepthDetails ArticlePubMed