BDBM255470 US9481682, 222
SMILES CCOc1cc(ccc1-c1nc([C@@H]2CC[C@@H]3N(C2)C(=O)CC3(C)C)n2ccnc(N)c12)C(=O)Nc1cc(ccn1)C(F)(F)F
InChI Key InChIKey=BWLHEDQZZCBBIH-GCJKJVERSA-N
Data  1 IC50
  Tab Delimited (TSV)   2D SDfile   Computed 3D by Vconf -m prep SDfile
Find this compound or compounds like it in BindingDB:
Activity Spreadsheet -- Enzyme Inhibition Constant Data from BindingDB
Found 1 hit for monomerid = 255470
TargetTyrosine-protein kinase BTK(Homo sapiens (Human))
Merck Sharp & Dohme
US Patent
LigandPNGBDBM255470(US9481682, 222)
Affinity DataIC50:  0.200nM. Assay description: BTK enzymatic activity was determined with the LANCE (Lanthanide Chelate Excite) TR-FRET (Time-resolved fluorescence resonance energy transfer) assay...
Ligand InfoPC cidPC sid
In DepthDetails US Patent